{"text_format":"1","workbook":"xlsx","n_sheets":3,"sheets":["計算表の例","選択値一覧","勘定科目"],"not_rendered":{"charts":0,"images":0,"macros":1,"external_links":0,"defined_names":0,"comments":0,"pivot_tables":0},"unopened":[],"bounds":{"document_bytes":16777216,"sheet_cells":100000,"rows_first":2000,"rows_last":500,"rows_between":2000,"halvings":0,"cell_chars":16384,"cell_head_chars":4096},"cells_cut":0,"cells_raw":0,"read":"whole","date_system":"1900"}

{"sheet":"計算表の例","index":0,"n_rows":15,"n_cols":4,"rows_kept":15,"cut":false,"hidden":false,"merged":[]}
["エラー非表示",false]
[null,null,"ファイル名"]
[null,null,"プレフィックス(勘定科目)"]
[null,null,"期（相対）"]
[null,null,"非連結/連結"]
["要素名(プレフィックス付き)","PeriodType"]
["jpcrp_cor:CompanyNameCoverPage",null,"会社名",{"$f":"XBRL_elread(D$2,$A7,$B$1)","v":"ファイル読込失敗"}]
["xbrli:period/xbrli:startDate","Duration","開始日",{"$f":"XBRL_contextread(D$2,D$4&$B8,$A8,$B$1)","v":"ファイル読込失敗"}]
["xbrli:period/xbrli:endDate","Duration","終了日","ファイル読込失敗"]
["xbrli:instant","Instant","時点（期末日）","ファイル読込失敗"]
[]
["要素名(プレフィックスは2行目)","PeriodType","勘定科目名"]
[null,{"$f":"VLOOKUP(A13,勘定科目!$B$2:$C$12,2,FALSE)","v":{"$error":"#N/A"}},null,{"$f":"XBRL_accread(D$2,D$3&$A13,D$4&$B13&D$5,$B$1)","v":{"$error":"#VALUE!"}}]
[null,{"$f":"VLOOKUP(A14,勘定科目!$B$2:$C$12,2,FALSE)","v":{"$error":"#N/A"}},null,{"$error":"#VALUE!"}]
[null,{"$f":"VLOOKUP(A15,勘定科目!$B$2:$C$12,2,FALSE)","v":{"$error":"#N/A"}},null,{"$error":"#VALUE!"}]

{"sheet":"選択値一覧","index":1,"n_rows":22,"n_cols":4,"rows_kept":22,"cut":false,"hidden":false,"merged":[]}
[]
["連結","連結"]
[null,"非連結","_NonConsolidatedMember"]
[null,"連結（旧バージョン）","Consolidated"]
[null,"非連結（旧バージョン）","NonConsolidated"]
[]
["期","当期","CurrentYear"]
[null,"1年前","Prior1Year"]
[null,"2年前","Prior2Year","掲載されていないことが多い"]
[null,"3年前","Prior3Year","掲載されていないことが多い"]
[null,"4年前","Prior4Year","掲載されていないことが多い"]
[null,"5年前","Prior5Year","掲載されていないことが多い"]
[]
["エラー表示","表示",true]
[null,"非表示（空白）",false]
[]
[]
["PeriodType","時点（貸借対照表など）","Instant"]
[null,"期間（損益計算書など）","Duration"]
[]
["勘定科目のプレフィックス","現行","jppfs_cor:"]
[null,"旧","jpfr-t-cte:"]

{"sheet":"勘定科目","index":2,"n_rows":12,"n_cols":3,"rows_kept":12,"cut":false,"hidden":false,"merged":[]}
["勘定科目名","要素名","periodType"]
["現金及び預金","CashAndDeposits","Instant"]
["売上高","NetSales","Duration"]
["経常利益","OrdinaryIncome","Duration"]
["自己資本","NetAssets","Instant"]
["純利益","NetIncome","Duration"]
["売上原価","CostOfSales","Duration"]
["流動負債","CurrentLiabilities","Instant"]
["総資産","LiabilitiesAndNetAssets","Instant"]
["流動資産","CurrentAssets","Instant"]
["営業利益","OperatingIncome","Duration"]
["支払利息","InterestExpensesNOE","Duration"]